user_login,user_email,source_user_id,user_pass,user_nicename,user_url,user_registered,display_name,role,nickname,first_name,last_name,description,rich_editing,syntax_highlighting,comment_shortcuts,admin_color,use_ssl,show_admin_bar_front,locale,cur2_capabilities,cur2_user_level,dismissed_wp_pointers,show_welcome_panel,cur2_dashboard_quick_press_last_post_id,community-events-location,astra-sites-on-active,_astra_sites_gettings_started,cur2_user-settings,cur2_user-settings-time,_woocommerce_tracks_anon_id,dismissed_wc_admin_notice,dismissed_no_secure_connection_notice,show_per_page,orderby,cur2_tablepress_user_options,managetablepress_listcolumnshidden,wc_last_active,managenav-menuscolumnshidden,metaboxhidden_nav-menus,nav_menu_recently_edited,cur2_defaulttoplevel_page_espresso_eventscolumnshidden,managetoplevel_page_espresso_eventscolumnshidden,closedpostboxes_espresso_events,metaboxhidden_espresso_events,closedpostboxes_wpsl_stores,metaboxhidden_wpsl_stores,ee_nav_menu_initialized,closedpostboxes_page,metaboxhidden_page,edit_page_per_page,espresso_events_default_per_page,maxgalleria_mlp_review_notice,mlfp_move_file_destination,mlf_display_info,cur2_defaultevent-espresso_page_espresso_messagescolumnshidden,manageevent-espresso_page_espresso_messagescolumnshidden,manageedit-wpsl_storescolumnshidden,edit_wpsl_stores_per_page,_yoast_wpseo_profile_updated,closedpostboxes_tribe_events,metaboxhidden_tribe_events,uagb-admin-rating,edit_tribe_events_per_page,_order_count,dismissed_update_notice,tribe-dismiss-notice,facebook,instagram,linkedin,myspace,pinterest,soundcloud,tumblr,twitter,youtube,wikipedia,last_update,tribe_setDefaultNavMenuBoxes,wpseo_title,wpseo_metadesc,wpseo_noindex_author,wpseo_content_analysis_disable,wpseo_keyword_analysis_disable,billing_first_name,billing_last_name,billing_company,billing_address_1,billing_address_2,billing_city,billing_postcode,billing_country,billing_state,billing_phone,billing_email,shipping_first_name,shipping_last_name,shipping_company,shipping_address_1,shipping_address_2,shipping_city,shipping_postcode,shipping_country,shipping_state,session_tokens,cur2_yoast_notifications,ast-minimum-addon-version-notice-min-ver,closedpostboxes_astra-advanced-hook,metaboxhidden_astra-advanced-hook,manageedit-tribe_eventscolumnshidden,closedpostboxes_bsf-sidebar,metaboxhidden_bsf-sidebar,meta-box-order_bsf-sidebar,screen_layout_bsf-sidebar,edit_post_per_page,theme-min-version-notice-min-ver,last_used_filters_tribe_events,tribe_columns_tribe_events,_wc_memberships_show_admin_restricted_content_notice,_wcs_subscription_ids_cache,_wc_plugin_framework_memberships_dismissed_messages,_wc_plugin_framework_memberships_mailchimp_dismissed_messages,wfls-last-login,sbi_seen_welcome_5_6,default_password_nag,astra-theme-rating,closedpostboxes_tablepress_edit,metaboxhidden_tablepress_edit,sbi_ignore_new_user_sale_notice,sbi_ignore_bfcm_sale_notice,closedpostboxes_attachment,metaboxhidden_attachment,meta-box-order_page,autodescription-user-settings,_wc_plugin_framework_facebook_for_woocommerce_dismissed_messages,entry_id,_gform-entry-id,_wc_google_analytics_pro_identity,meta-box-order_tribe_events,cur2_woocommerce_product_import_mapping,cur2_product_import_error_log,_woocommerce_persistent_cart_1,_wc_memberships_mailchimp_sync_opt_in,closedpostboxes_product,metaboxhidden_product,_sv_wc_jilt_enabled_messages,_wc_memberships_hidden_profile_field_columns,_sv_wc_jilt_dismissed_messages,_wc_memberships_show_user_incomplete_profile_notice,_pum_dismissed_alerts,closedpostboxes_dashboard,metaboxhidden_dashboard,shipping_method,cur2__stripe_customer_id,paying_customer,maxgalleria_mlp_feature_notice,cur2_media_library_mode,_pum_reviews_dismissed_triggers,_pum_reviews_last_dismissed,w3tc_features_seen,_wc_plugin_framework_google_analytics_pro_dismissed_messages,meta-box-order_product,screen_layout_product,manageedit-productcolumnshidden,edit_product_per_page,mailchimp_woocommerce_is_subscribed,extendifysdk_uuid,extendifysdk_user_data,closedpostboxes_,metaboxhidden_,wfls-dismiss-wfls-woocommerce-integration-notice,shipping_phone,affiliate_key,_last_order,apf_total_balance,apf_total_earn,apf_total_referred,reports,uap_affiliate_payment_type,closedpostboxes_results,metaboxhidden_results,_money_spent,uap_locale_code,uap_avatar,uap_country,tribe-dismiss-notice-time-pue_key-invalid_key,_wc_memberships_profile_field_gender,_wc_memberships_profile_field_date_of_birth,_wc_memberships_profile_field_primary_training_venue_days,_wc_memberships_profile_field_secondary_training_venue_name,_wc_memberships_profile_field_secondary_training_venue_address,_wc_memberships_profile_field_secondary_training_venue_telephone,_wc_memberships_profile_field_secondary_training_venue_days,_wc_memberships_profile_field_secondary_training_venue_times,_wc_memberships_profile_field_emergency_contact_name,_wc_memberships_profile_field_emergency_contact_phone_number,_wc_memberships_profile_field_coach_first_name,_wc_memberships_profile_field_coach_last_name,_wc_memberships_profile_field_primary_training_venue_name,_wc_memberships_profile_field_primary_training_venue_address,_wc_memberships_profile_field_primary_training_venue_telephone,_wc_memberships_profile_field_coach_mobile_number,_wc_memberships_profile_field_primary_training_venue_times,_wc_memberships_profile_field_affiliated_club,meta-box-order_astra-advanced-hook,_wc_memberships_profile_field_coach_email_address,tribe-dismiss-notice-time-maybe_display_rsvp_new_views_options_notice,uuid,mepr-address-one,mepr-address-two,mepr-address-city,mepr-address-country,mepr-address-state,mepr-address-zip,_mepr_stripe_customer_id_rk0vvi-3x9_AUD,meta-box-order_ticket-meta-fieldset,screen_layout_ticket-meta-fieldset,signup_notice_sent,mepr_agree_to_tos,mepr-geo-country,mepr_gender,mepr_date_of_birth,mepr_emergency_contact_name,mepr_emergency_contact_phone_number,mepr_coach_first_name,mepr_coach_last_name,mepr_coach_email_address,mepr_coach_mobile_number,mepr_primary_training_venue_name,mepr_primary_training_venue_address,mepr_primary_training_venue_telephone,mepr_primary_training_venue_days,mepr_primary_training_venue_times,mepr_secondary_training_venue_name,mepr_secondary_training_venue_address,mepr_secondary_training_venue_telephone,mepr_secondary_training_venue_days,mepr_secondary_training_venue_times,ID,mp_members_perpage,mepr_dismiss_notice_get_started,mepr_user_message,mailchimp_woocommerce_gdpr_fields,mepr_phone_number,managememberpress_page_memberpress-memberscolumnshidden,edit_shop_order_per_page,mp_transactions_perpage,wpda_manage_columnshidden_toplevel_page_wpdainformation_schema_tables,wpda_manage_columnshidden_wp-data-access_page_wpda_publishercur2_wpda_publisher,wpda_rows_per_page_information_schema_tables,wpda_manage_columnshidden_wp-data-access_page_wpda_designercur2_wpda_table_design
23malonr@gmail.com,23malonr@gmail.com,337,$P$B.E5v/1tXyu1BuCbf6TgyEJdBBPpOA/,23malonrgmail-com,,2022-11-07 11:45:20,riley maloney,"subscriber,member",23malonr@gmail.com,riley,maloney,,true,true,false,fresh,0,true,,"a:2:{s:10:""subscriber"";b:1;s:6:""member"";b:1;}",0,,,,,,,,,,,,,,,,1667779200,,,,,,,,,,,,,,,,,,,,,,,,,,,,,,,,,,,,,,,,1667821649,,,,,,,,,,,,,,,,,,,,,,,,,,,"a:1:{s:64:""04d0cc68fccd5d9bf8d40a077ce043dfce2f45192d68750bdc4a2aa08679f6fc"";a:4:{s:10:""expiration"";i:1667994320;s:2:""ip"";s:39:""2001:8004:12f1:743e:cdf8:9714:2379:acb5"";s:2:""ua"";s:139:""Mozilla/5.0 (iPhone; CPU iPhone OS 15_6_1 like Mac OS X) AppleWebKit/605.1.15 (KHTML, like Gecko) Version/15.6.1 Mobile/15E148 Safari/604.1"";s:5:""login"";i:1667821520;}}",,,,,,,,,,,,,,,,,,1667821519,,,,,,,,,,,,,,,1629011342.16678,,,,"a:1:{s:4:""cart"";a:0:{}}",,,,,,,,,,,,,,,,,,,,,,,,1,,,,,,,,,,,,,,,,,,,,,,,,,,,,,,,,,,,,,,,,,,a636c1509c884c1e4b3ba16cd656d235,34 agnes st wynnum,,Brisbane,AU,QLD,4178,cus_MkzlGPymcAEPGG,,,1,1,,male,9 July 2005,John Maloney,'+61417852098,Isaac,Reynaud,barloadedperformance@gmail.com,'+61402007251,Anytime fitness wynnum,89 florence st wynnum,'+61437006148,"a:4:{i:0;s:6:""monday"";i:1;s:9:""wednesday"";i:2;s:8:""thursday"";i:3;s:6:""friday"";}",5-7,valhalla strength,4/9 north link pl virginia,'+61431612226,"a:4:{i:0;s:6:""monday"";i:1;s:9:""wednesday"";i:2;s:8:""thursday"";i:3;s:6:""friday"";}",5-7,,,,,,,,,,,,,
383468066@qq.com,383468066@qq.com,326,$P$B4Sxql5iEqig6uxbRxqAHNmSwktqXP/,383468066qq-com,,2022-10-31 02:03:08,Ke Huang,"subscriber,member",383468066@qq.com,Ke,Huang,,true,true,false,fresh,0,true,,"a:2:{s:10:""subscriber"";b:1;s:6:""member"";b:1;}",0,,,,,,,,,,,,,,,,1667174400,,,,,,,,,,,,,,,,,,,,,,,,,,,,,,,,,,,,,,,,1667256664,,,,,,,,,,,,,,,,,,,,,,,,,,,"a:1:{s:64:""4a10570d95f48e415d5c4e51cd0afbc35bccf14a4ef6a4c6e7019b2998efd85b"";a:4:{s:10:""expiration"";i:1667354588;s:2:""ip"";s:15:""131.217.255.209"";s:2:""ua"";s:137:""Mozilla/5.0 (iPhone; CPU iPhone OS 14_6 like Mac OS X) AppleWebKit/605.1.15 (KHTML, like Gecko) Version/14.1.1 Mobile/15E148 Safari/604.1"";s:5:""login"";i:1667181788;}}",,,,,,,,,,,,,,,,,,1667181788,,,,,,,,,,,,,,,866451666.166626,,,,"a:1:{s:4:""cart"";a:0:{}}",,,,,,,,,,,,,,,,,,,,,,,,1,,,,,,,,,,,,,,,,,,,,,,,,,,,,,,,,,,,,,,,,,,85df7f6d15f3159b0b7ebe2f37d9aa51,Kerslake Hall UTAS,,Launceston,AU,TAS,7248,cus_MiDmKghpGz17Iv,,,1,1,,male,22 October 1999,YuPing Mi,8613770772297,Ke,Huang,383468066@qq.com,61492402210,Uni Gym UTAS,Launceston UTAS,61363243092,"a:4:{i:0;s:6:""monday"";i:1;s:7:""tuesday"";i:2;s:8:""thursday"";i:3;s:6:""friday"";}",19:00~22:00,,,,,,326,,,,,,,,,,,,
aa9884394,aa9884394@gmail.com,69,$P$BjE2gHUot85KqlxWzQXYlkTCSRAbd91,aa9884394,,2021-08-23 15:02:44,aa9884394,customer,aa9884394,,,,true,true,false,fresh,0,true,,"a:1:{s:8:""customer"";b:1;}",0,,,,,,,,,,,,,,,,,,,,,,,,,,,,,,,,,,,,,,,,,,,0,,,,,,,,,,,,,,,,,,,,,,,,,,,,,,,,,,,,,,,,"a:1:{s:64:""7bb913e7d86724a8eb06ca6e3eea559aa6c316aadc0c4a09c684683139209be2"";a:4:{s:10:""expiration"";i:1630940564;s:2:""ip"";s:14:""141.101.104.72"";s:2:""ua"";s:78:""Mozilla/5.0 (Windows NT 10.0; Win64; x64; rv:47.0) Gecko/20100101 Firefox/47.0"";s:5:""login"";i:1629730964;}}",,,,,,,,,,,,,,,,,,,,,,,,,,,,,,,,,,,,,,,,,,,,,,,,,,,,,,,,,,,,,1,,,,,,,,,,,,,,,,0,,,,,,,,,,,,,,,,,,,,,,,,,,aa7007086e8bf422d5675d84c83c981d,,,,,,,,,,,,,,,,,,,,,,,,,,,,,,,,,,,,,,,,,,,
abignell3,adzywastaken@gmail.com,200,$P$Bh/jdwiR8KG9fWXt/VT7xEAAbRSPYE.,abignell3,,2022-01-18 00:00:00,Adam Bignell,member,abignell3,Adam,Bignell,,true,true,false,fresh,0,true,,"a:1:{s:6:""member"";b:1;}",0,,,,,,,,,,,,,,,,,,,,,,,,,,,,,,,,,,,,,,,,,,,,,,,,,,,,,,,,1667256670,,,,,,,,,,,,,,,,,,,,,,,,,,,,,,,,,,,,,,,,,,,,,,,,,,,,,,,,,,,,,,,,,,,,,,,,,,,,,,,,,,,,,,,,1,,,,,,,,,,,,,,,,,,,,,Male,2004-07-13,,GoodLife Health Club Waverley Park,"5/2 Stadium Cct, Mulgrave VIC 3170",(03) 8544 4100,Sun,4-6pm,Peter Bignell,423146817,n/a,n/a,GoodLife Health Club Wantirna,"141 Mountain Hwy, Wantirna VIC 3152",(03) 8805 2500,,,,,,,3575c4675b5e8f75ecd5779c9eb3e935,30 Glen Road Belgrave Heights 3160 VIC,,,AU,VIC,,,,,,,,male,2004-07-13,Peter Bignell,423146817,n/a,n/a,n/a,,GoodLife Health Club Wantirna,"141 Mountain Hwy, Wantirna VIC 3152",(03) 8805 2500,"a:2:{i:0;s:3:""Tue"";i:1;s:3:""Thu"";}",4-6pm,GoodLife Health Club Waverley Park,"5/2 Stadium Cct, Mulgrave VIC 3170",(03) 8544 4100,"a:1:{i:0;s:3:""Sun"";}",4-6pm,1409,,,,,,,,,,,,
acheng9,andycheng123@hotmail.com,193,$P$BXALdDz7r.XOd6Ttsz/Vj96A6xZJRX.,acheng9,,2022-02-07 00:00:00,Andy Cheng,member,acheng9,Andy,Cheng,,true,true,false,fresh,0,true,,"a:1:{s:6:""member"";b:1;}",0,,,,,,,,,,,,,,,,,,,,,,,,,,,,,,,,,,,,,,,,,,,,,,,,,,,,,,,,1667256668,,,,,,,,,,,,,,,,,,,,,,,,,,,,,,,,,,,,,,,,,,,,,,,,,,,,,,,,,,,,,,,,,,,,,,,,,,,,,,,,,,,,,,,,1,,,,,,,,,,,,,,,,,,,,,Male,1997-09-24,,,,,,,Bo,385020191,Oscar,Liang,Training Day Burwood,"118 Highbury Rd, Burwood VIC 3125",0424 429 600,,,,,,,fbada73c53838af5ce06353d42c6bc9b,16B Clifford Street Glen Waverley 3150 VIC,,,AU,VIC,,,,,,,,male,1997-09-24,Bo,385020191,Oscar,Liang,raczo100@hotmail.com,,Training Day Burwood,"118 Highbury Rd, Burwood VIC 3125",0424 429 600,"a:4:{i:0;s:3:""Mon"";i:1;s:3:""Tue"";i:2;s:3:""Thu"";i:3;s:3:""Fri"";}",7pm-9pm,,,,,,1245,,,,,,,,,,,,
acui1,AndrewLTsui@Gmail.com,144,$P$B1rKEUr9DP53aXkrRqB1kAQqrbrArW0,acui1,,2022-06-22 00:00:00,Andrew Cui,member,acui1,Andrew,Cui,,true,true,false,fresh,0,true,,"a:1:{s:6:""member"";b:1;}",0,,,,,,,,,,,,,,,,,,,,,,,,,,,,,,,,,,,,,,,,,,,,,,,,,,,,,,,,1667256669,,,,,,,,,,,,,,,,,,,,,,,,,,,,,,,,,,,,,,,,,,,,,,,,,,,,,,,,,,,,,,,,,,,,,,,,,,,,,,,,,,,,,,,,1,,,,,,,,,,,,,,,,,,,,,Male,1991-01-07,a:0:{},,,,,,Brooke Davey,432272376,,,,,,,,,,,,2b9164e208abe9fcf1e653d1e59f4bb2,3A Leawarra Drive Heathmont 3135 VIC,,,AU,VIC,,,,,,,,male,1991-01-07,Brooke Davey,432272376,,,,,,,,,,,,,,,314,,,,,,,,,,,,
adaley18,annie272322@gmail.com,124,$P$B9KFrC7YMGYSVFgCSr2dFXpSGBBNwI1,adaley18,,2022-07-26 00:00:00,Andrea Daley,member,adaley18,Andrea,Daley,,true,true,false,fresh,0,true,,"a:1:{s:6:""member"";b:1;}",0,,,,,,,,,,,,,,,,,,,,,,,,,,,,,,,,,,,,,,,,,,,,,,,,,,,,,,,,1667256670,,,,,,,,,,,,,,,,,,,,,,,,,,,,,,,,,,,,,,,,,,,,,,,,,,,,,,,,,,,,,,,,,,,,,,,,,,,,,,,,,,,,,,,,1,,,,,,,,,,,,,,,,,,,,,Female,1967-04-27,,Zap Fitness,3 Terry Street Glenorchy,1300 927 348,"Mon,Wed,Sat",16:30,LYNDON DALEY,0417 590 891,Matthew,MCKAY,Raw Strength,59a Albert Road Moonah,0447 298 424,,,,,,,7be2b1d07c36921b8ab3abf3e2b012a0,50 Cockerills Road Boyer 7140 TAS,,,AU,TAS,,,,,,,,female,1967-04-27,LYNDON DALEY,0417 590 891,Matthew,MCKAY,mmckay@powerliftingaustralia.com,,Raw Strength,59a Albert Road Moonah,0447 298 424,"a:5:{i:0;s:3:""Mon"";i:1;s:3:""Tue"";i:2;s:3:""Wed"";i:3;s:3:""Thu"";i:4;s:3:""Sat"";}",16:30,Zap Fitness,3 Terry Street Glenorchy,1300 927 348,"a:3:{i:0;s:3:""Mon"";i:1;s:3:""Wed"";i:2;s:3:""Sat"";}",16:30,174,,,,,,,,,,,,
adavis139,adrianrdavis01@outlook.com,243,$P$BqFmRSEWNi13xU6TfDh9pJjk1w/wfu/,adavis139,,2022-03-31 00:00:00,Adrian Davis,member,adavis139,Adrian,Davis,,true,true,false,fresh,0,true,,"a:1:{s:6:""member"";b:1;}",0,,,,,,,,,,,,,,,,,,,,,,,,,,,,,,,,,,,,,,,,,,,,,,,,,,,,,,,,1667256668,,,,,,,,,,,,,,,,,,,,,,,,,,,,,,,,,,,,,,,,,,,,,,,,,,,,,,,,,,,,,,,,,,,,,,,,,,,,,,,,,,,,,,,,1,,,,,,,,,,,,,,,,,,,,,Male,2022-01-01,,,,,,,Jane Hannaford,417521168,Sam,Davis,"Derrimut, Coolaroo","Coolaroo, Vic",393037688,,,,,,,64ddc7e26019211cc2670de22419567a,8 Grange Rise Craigieburn 3064 VIC,,,AU,VIC,,,,,,,,male,2022-01-01,Jane Hannaford,417521168,Sam,Davis,adrianrdavis01@outlook.com,,"Derrimut, Coolaroo","Coolaroo, Vic",393037688,"a:6:{i:0;s:3:""Mon"";i:1;s:3:""Tue"";i:2;s:3:""Wed"";i:3;s:3:""Thu"";i:4;s:3:""Fri"";i:5;s:3:""Sat"";}",5:45am,,,,,,1735,,,,,,,,,,,,
adickens5,anthony.dickens@fernwoodfitness.com.au,187,$P$Byb9ocq1ZHKLLJ25Cj.aUwBraVz1xX.,adickens5,,2022-02-16 00:00:00,Anthony Dickens,member,adickens5,Anthony,Dickens,,true,true,false,fresh,0,true,,"a:1:{s:6:""member"";b:1;}",0,,,,,,,,,,,,,,,,,,,,,,,,,,,,,,,,,,,,,,,,,,,,,,,,,,,,,,,,1667256668,,,,,,,,,,,,,,,,,,,,,,,,,,,,,,,,,,,,,,,,,,,,,,,,,,,,,,,,,,,,,,,,,,,,,,,,,,,,,,,,,,,,,,,,1,,,,,,,,,,,,,,,,,,,,,Male,1965-03-03,,,,,,,ANTHONY DICKENS,409002060,Anthony,Dickens,Doherty's Gym,Weston St Brunswick,9388 0866,,,,,,,0990150c953f6ac88c308a1bb1ac6645,15 Laluma st Essendon 3040 VIC,,,AU,VIC,,,,,,,,male,1965-03-03,ANTHONY DICKENS,409002060,Anthony,Dickens,wisbeyl@tpg.com.au,,Doherty's Gym,Weston St Brunswick,9388 0866,"a:3:{i:0;s:3:""Mon"";i:1;s:3:""Wed"";i:2;s:3:""Fri"";}",7am,,,,,,1044,,,,,,,,,,,,